Year,Jurisdiction,Jur_Name,Parcel_ID,Account,Ownership_Sequence,Owner_Id,Owner_Prefix,Name,Careof,Street,Street_Overflow,City,State,Zip5,Zip4,Location_Code,Jur 1,Jur 2,Jur 3,Jur 4,Jur 5,Jur 6,Jur 7,Jur 8,Jur 9,Jur 10,Jur 11,Jur 12,Is_Exempt,Prop_Street_Number,Prop_Street,Prop_Street_Dir,Prop_City,Prop_State,Prop_Zip5,Prop_Zip4,Map1,Map2,Is_Protested,Has_Hs_Link,Primary_Category_Code,Secondary_Category_Code,Third_Category_Code,DBA,Route_Code,Route_Order,Route_SubOrder,Interest,Ceiling_Year,Ceiling_Tax,Homestead_Code,Agent_Code,Agent_Mailing,Agent_Name,Agent_Address1,Agent_Address2,Agent_City,Agent_State,Agent_Zip5,Agent_Zip4,Acres,Legal1,Legal2,Legal3,Legal4,Mortgage_Code,Lease_Number,Lease_Name,Operator_Name,RRC_Number,Interest_Type,Land_Hs,Land_Nhs,Land_Productivity_Market,Land_1d1,Land_1d,Land_Timber,Personal_Hs,Personal_Nhs,New_Personal_Hs,New_Personal_Nhs,Improvement_Hs,New_Improvement_Hs,Improvement_Nhs,New_Improvement_Nhs,Income_Land,Income_Improvement,Market_Value,Net_Taxable_Value,State_Homestead,State_Mandated_Over65,State_Mandated_Disabled,Optional65,Local_Disabled,Road_Homestead,Disabled_Veteran,Is_Owner_Confidential,Local_Discount,Has_Abatement,Has_Miscellaneous_Exemption,Abatement_Value,Mineral_Freeport_Value,Mineral_Unknown_Value
2023,01,CAD,2,1-10-300010010010000000,1,3074178,R,BE ANADARKO II LLC,,PO BOX 2871,,WIMBERLEY,TX,78676,,10,01,02,03,10,12,22,32,,,,,,False,,NAIDA,,,TX,,,,,False,False,C1R,,,,,0,,1.000000,0,0.00,,,0,,,,,,,,1.5900,TRACT 1 BLK 1 152,OFFICE & INDUST PARK,,,,,,,,,0,15900,0,0,0,0,0,0,0,0,0,0,0,0,0,0,15900,15900,0,0,0,0,0,0,0,False,0,False,False,0,0,0
2023,01,CAD,3,1-10-300010010010010000,1,3074178,R,BE ANADARKO II LLC,,PO BOX 2871,,WIMBERLEY,TX,78676,,10,01,02,03,10,12,22,32,,,,,,False,1917,ALCOCK,,,TX,,,4-050,,False,False,F2,,,,,0,,1.000000,0,0.00,,,0,,,,,,,,2.3300,TR 1A BLK 1 152,OFFICE & IND PARK,,,,,,,,,0,23300,0,0,0,0,0,0,0,0,0,0,159420,0,0,0,182720,182720,0,0,0,0,0,0,0,False,0,False,False,0,0,0
2023,01,CAD,4,1-10-300010020010000000,1,391550,R,HARDEN GALE,,BOX 2696,,PAMPA,TX,79066,,10,01,02,03,10,12,22,32,,,,,,False,1801,ALCOCK,,,,,,3-050,,False,False,F1,,,,S11,360,,1.000000,0,0.00,,,0,,,,,,,,0.5100,PART OF LOT 1 BLK 2,152 OFFICE & IND PRK,,,,,,,,,0,5100,0,0,0,0,0,0,0,0,0,0,45840,0,0,0,50940,50940,0,0,0,0,0,0,0,False,0,False,False,0,0,0
2023,01,CAD,5,1-10-300010020020000000,1,3073513,R,"PAMPA SECURE STORAGE, LLC",,4843 COLLEYVILLE BLVD,STE 251-318,COLLEYVILLE,TX,76034,,10,01,02,03,10,12,22,32,,,,,,False,,NAIDA,N,,TX,,,,,False,False,F1,,,,,0,,1.000000,0,0.00,,,0,,,,,,,,3.9600,PART OF LOT 1,LOTS 2-6 BLK 2,152 OFFICE & IND PK,,,,,,,,0,27600,0,0,0,0,0,0,0,0,0,0,483840,0,0,0,511440,511440,0,0,0,0,0,0,0,False,0,False,False,0,0,0
2023,01,CAD,7,1-10-300010020040000000,1,3074204,R,"CORNERSTONE INVESTMENTS, LLC",,539 W COMMERCE ST,SUITE 1922,DALLAS,TX,75208,,10,01,02,03,10,12,22,32,,,,,,False,1807,ALCOCK,,,,,,,,False,False,F1,,,,,0,,1.000000,0,0.00,,,0,,,,,,,,1.4400,PART OF LOT 1 BLK 2,152 OFFICE & IND PK,,,,,,,,,0,14400,0,0,0,0,0,0,0,0,0,0,90940,0,0,0,105340,105340,0,0,0,0,0,0,0,False,0,False,False,0,0,0
2023,01,CAD,10,1-10-300010020070000000,1,3073513,R,"PAMPA SECURE STORAGE, LLC",,4843 COLLEYVILLE BLVD,STE 251-318,COLLEYVILLE,TX,76034,,10,01,02,03,10,12,22,32,,,,,,False,100,NAIDA,,,TX,,,3-050,,False,False,F1,,,,,0,,1.000000,0,0.00,,,0,,,,,,,,1.0000,LOT 7 BLK 2 152,OFFICE & INDUST PARK,,,,,,,,,0,4000,0,0,0,0,0,0,0,0,0,0,72470,0,0,0,76470,76470,0,0,0,0,0,0,0,False,0,False,False,0,0,0
2023,01,CAD,11,1-10-300010030010000000,1,3073513,R,"PAMPA SECURE STORAGE, LLC",,4843 COLLEYVILLE BLVD,STE 251-318,COLLEYVILLE,TX,76034,,10,01,02,03,10,12,22,32,,,,,,False,,NAIDA,,,TX,,,,,False,False,C1R,,,,,0,,1.000000,0,0.00,,,0,,,,,,,,1.0000,E170 OF N40 OF 1,BLK 3,152 OFFICE & IND PRK,,,,,,,,0,400,0,0,0,0,0,0,0,0,0,0,0,0,0,0,400,400,0,0,0,0,0,0,0,False,0,False,False,0,0,0
2023,01,CAD,12,1-10-300010030011000000,1,916850,R,T L RENTAL PROPERTIES,LIMITED PARTNERSHIP,101 S. NAIDA,,PAMPA,TX,79065,,10,01,02,03,10,12,22,32,,,,,,False,,,,,TX,,,,,False,False,C1C,,,,,0,,1.000000,0,0.00,,,0,,,,,,,,6.0000,LOT 1 EXCEPT E170,OF N40 & ALL 2-6,152 OFFICE & IND PRK,,,,,,,,0,5000,0,0,0,0,0,0,0,0,0,0,0,0,0,0,5000,5000,0,0,0,0,0,0,0,False,0,False,False,0,0,0
2023,01,CAD,18,1-10-300010030070000000,1,100520,R,ENCISO RAUL & ANA,,1811 CHESTNUT DR,,PAMPA,TX,79065,,10,01,02,03,10,12,22,32,,,,,,False,,NAIDA,,,TX,,,,,False,False,C1R,,,,,0,,1.000000,0,0.00,,,0,,,,,,,,2.0220,LOTS 12-15 BLK 3,152 OFFICE & IND PRK,,,,,,,,,0,1820,0,0,0,0,0,0,0,0,0,0,0,0,0,0,1820,1820,0,0,0,0,0,0,0,False,0,False,False,0,0,0
2023,01,CAD,27,1-10-300010040010000000,1,658350,R,MURPHY-BROWN LLC,,PO BOX 856,,WARSAW,NC,28398,0856,10,01,02,03,10,12,22,32,,,,,,False,13051,HWY 60,,,TX,,,,,False,False,F2,,,,,0,,1.000000,0,0.00,,R2885,1,RYAN LLC,1233 WEST LOOP S,SUITE 1500,HOUSTON,TX,77027,,3.2200,LOT 1 BLK 4   152,OFFICE&INDUSTRIAL PK,3.22 ACRES,,,,,,,,0,1610,0,0,0,0,0,0,0,0,0,0,269320,0,0,0,270930,270930,0,0,0,0,0,0,0,False,0,False,False,0,0,0
2023,01,CAD,28,1-10-300010040020000000,1,331650,R,GARCIA FRANCISCO & MERCED,,PO RET 12/2015,,,,,,10,01,02,03,10,12,22,32,,,,,,False,,,,,TX,,,,,False,False,C1R,,,,,0,,1.000000,0,0.00,,,0,,,,,,,,4.1800,LOT 2 BLK 4 152,OFFICE INDUSTRIAL PK,4.18 ACRES,,,,,,,,0,2090,0,0,0,0,0,0,0,0,0,0,0,0,0,0,2090,2090,0,0,0,0,0,0,0,False,0,False,False,0,0,0
2023,01,CAD,29,1-10-300010040021000000,1,592200,R,MAYBERRY WENDELL,,1308 E FOSTER AVE,,PAMPA,TX,79065,,10,01,02,03,10,12,22,32,,,,,,False,,,,,TX,,,,,False,False,C1R,,,,,0,,1.000000,0,0.00,,,0,,,,,,,,1.9400,LOT 2 BLK 4 152,OFFICE INDUSTRIAL PL,1.94 ACRES,,,,,,,,0,970,0,0,0,0,0,0,0,0,0,0,0,0,0,0,970,970,0,0,0,0,0,0,0,False,0,False,False,0,0,0
2023,01,CAD,30,1-10-300010040021100000,1,331000,R,GARAY MARCO,,P O BOX 454,,CACTUS,TX,79013,,10,01,02,03,10,12,22,32,,,,,,False,,,,,TX,,,,,False,False,C1R,,,,,0,,1.000000,0,0.00,,,0,,,,,,,,1.0000,LOT 2 BLK 4 152,OFFICE INDUSTRIAL PL,1.00 ACRE,,,,,,,,0,500,0,0,0,0,0,0,0,0,0,0,0,0,0,0,500,500,0,0,0,0,0,0,0,False,0,False,False,0,0,0
2023,01,CAD,31,1-10-300010050010000000,1,703350,R,PANTECHS LABORATORIES INC,,PO BOX 64489,,LUBBOCK,TX,79464,4489,10,01,02,03,10,12,22,32,,,,,,False,1901,CARTER,,,TX,,,3-050,,False,False,F2,,,,,0,,1.000000,0,0.00,,,0,,,,,,,,1.0000,LOT 1 BLK 5 OFFICE,& INDUSTRIAL PARK,,,,,,,,,0,4000,0,0,0,0,0,0,0,0,0,0,52970,0,0,0,56970,56970,0,0,0,0,0,0,0,False,0,False,False,0,0,0
2023,01,CAD,32,1-10-300010050020000000,1,419950,R,HESS CHILDRENS LTD PTR,,BOX 721,,PAMPA,TX,79066,,10,01,02,03,10,12,22,32,,,,,,False,111,NAIDA,,,TX,,,3-050,,False,False,F2,,,,,0,,1.000000,0,0.00,,R6032,1,MERITAX LLC.,14875 LANDMARK BLVD.,SUITE 125,DALLAS,TX,75254,,2.0000,LOTS 2&3 BLK 5 152,OFFICE & INDUST. PK,,,,,,,,,4000,0,0,0,0,0,0,0,0,0,307910,0,0,0,0,0,311910,311910,0,0,0,0,0,0,0,False,0,False,False,0,0,0
2023,01,CAD,33,1-10-300010050040000000,1,35700,R,ATACORP INC,,PO BOX 1916,,PAMPA,TX,79066,,10,01,02,03,10,12,22,32,,,,,,False,101,NAIDA,,,TX,,,3-050,,False,False,F2,,,,,0,,1.000000,0,0.00,,,0,,,,,,,,1.0000,LOT 4 BLK 5 152,OFFICE & INDUST PARK,,,,,,,,,0,1100,0,0,0,0,0,0,0,0,0,0,247760,0,0,0,248860,248860,0,0,0,0,0,0,0,False,0,False,False,0,0,0
2023,01,CAD,34,1-10-300010050050000000,1,111500,R,BROWN FRED METHANOL INC,,309 W 7TH  STE 1020,,FORT WORTH,TX,76102,6904,10,01,02,03,10,12,22,32,,,,,,False,,NAIDA,,,TX,,,,,False,False,C1R,,,,,0,,1.000000,0,0.00,,R2225,1,KIRKWOOD & DARBY INC,309 WEST 7TH ST,SUITE 1020,FORT WORTH,TX,76102,,7.0000,LOTS 5-11 BLK 5,152 OFFICE &,INDUST PARK,,,,,,,,7700,0,0,0,0,0,0,0,0,0,0,0,0,0,0,0,7700,7700,0,0,0,0,0,0,0,False,0,False,False,0,0,0
2023,01,CAD,35,1-10-300010050060000000,1,111500,R,BROWN FRED METHANOL INC,,309 W 7TH  STE 1020,,FORT WORTH,TX,76102,6904,10,01,02,03,10,12,22,32,,,,,,False,,,,,TX,,,,,False,False,C1R,,,,,0,,1.000000,0,0.00,,,0,,,,,,,,1.0000,LOT 6 BLK 5,152 OFFICE & INDUST,PARK,,,,,,,,0,1100,0,0,0,0,0,0,0,0,0,0,0,0,0,0,1100,1100,0,0,0,0,0,0,0,False,0,False,False,0,0,0
2023,01,CAD,41,1-10-300010050120000000,1,701600,R,PAMPA SOCCER ASSOC,,PO BOX 997,,PAMPA,TX,79066,,10,01,02,03,10,12,22,32,,,,,,True,248,NAIDA,,,TX,,,,,False,False,XVF,,,,,0,,1.000000,0,0.00,,,0,,,,,,,,1.0000,LOTS 12-19 BLK 5 152,OFFICE & INDUST PARK,,,,,,,,,0,8800,0,0,0,0,0,0,0,0,0,0,29320,0,0,0,38120,0,0,0,0,0,0,0,0,False,0,False,False,0,0,0
2023,01,CAD,49,1-10-300050010010000000,1,3070446,R,THOMASON WHITSON LILLIAN VINA,,304 ANNE ST.,,PAMPA,TX,79065,,10,01,02,03,10,12,22,32,,,,,,False,863,LOCUST,E,,TX,,,,,False,False,C1,,,,,0,,1.000000,0,0.00,,,0,,,,,,,,0.1447,LOT 1 BLK 1,ALLAM ADDITION,,,,,,,,,0,900,0,0,0,0,0,0,0,0,0,0,0,0,0,0,900,900,0,0,0,0,0,0,0,False,0,False,False,0,0,0
2023,01,CAD,50,1-10-300050010020000000,1,736750,R,PORTILLO MARIO ESTATE,,920 VARNON,,PAMPA,TX,79065,,10,01,02,03,10,12,22,32,,,,,,False,857,LOCUST,E,,TX,,,1 030,,False,False,A1,,,,,0,,1.000000,0,0.00,,,0,,,,,,,,0.1378,LOT 2 BLK 1,ALLAM ADDITION,,,,,,,,,860,0,0,0,0,0,0,0,0,0,11710,0,0,0,0,0,12570,12570,0,0,0,0,0,0,0,False,0,False,False,0,0,0
2023,01,CAD,51,1-10-300050010030000000,1,3074146,R,RIVERA SARA ALICIA,,PO RET 04/2023,,,,,,10,01,02,03,10,12,22,32,,,,,,False,853,LOCUST,E,,TX,,,1 030,,False,False,A1,,,,,0,,1.000000,0,0.00,,,0,,,,,,,,0.1378,LOT 3 BLK 1,ALLAM ADDITION,,,,,,,,,0,860,0,0,0,0,0,0,0,0,8360,0,0,0,0,0,9220,9220,0,0,0,0,0,0,0,False,0,False,False,0,0,0
2023,01,CAD,52,1-10-300050010040000000,1,596175,R,MC CLELLAND RANDY & VICKI,,828 LOCUST,,PAMPA,TX,79065,,10,01,02,03,10,12,22,32,,,,,,False,851,LOCUST,E,,TX,,,1 030,,False,False,A1,,,,,0,,1.000000,0,0.00,,,0,,,,,,,,0.1378,LOT 4 BLK 1,ALLAM ADDITION,,,,,,,,,860,0,0,0,0,0,0,0,0,0,5730,0,0,0,0,0,6590,6590,0,0,0,0,0,0,0,False,0,False,False,0,0,0
2023,01,CAD,53,1-10-300050010050000000,1,336100,R,GARZA EDUARDO,,834 E CRAVEN,,PAMPA,TX,79065,,10,01,02,03,10,12,22,32,,,,,,False,847,LOCUST,E,,TX,,,1 030,,False,False,C1,,,NO MOBILE HOME,,0,,1.000000,0,0.00,,,0,,,,,,,,0.1378,LOT 5 BLK 1,ALLAM ADDITION,,,,,,,,,0,860,0,0,0,0,0,0,0,0,0,0,0,0,0,0,860,860,0,0,0,0,0,0,0,False,0,False,False,0,0,0
2023,01,CAD,54,1-10-300050010070000000,1,578700,R,MARIN JOSE L,,832 E CRAVEN,,PAMPA,TX,79065,,10,01,02,03,10,12,22,32,,,,,,False,819,LOCUST,E,,TX,,,1 030,,False,False,C1,,,,,0,,1.000000,0,0.00,,,0,,,,,,,,0.2756,LOTS 6&7 BLK 1,ALLAM ADDITION,,,,,,,,,0,1720,0,0,0,0,0,0,0,0,0,0,0,0,0,0,1720,1720,0,0,0,0,0,0,0,False,0,False,False,0,0,0
2023,01,CAD,55,1-10-300050010080000000,1,578700,R,MARIN JOSE L,,832 E CRAVEN,,PAMPA,TX,79065,,10,01,02,03,10,12,22,32,,,,,,False,817,LOCUST,E,,TX,,,1 030,,False,False,C1,,,,,0,,1.000000,0,0.00,,,0,,,,,,,,0.1090,E34 OF 8 BLK 1,ALLAM ADDITION,,,,,,,,,0,680,0,0,0,0,0,0,0,0,0,0,0,0,0,0,680,680,0,0,0,0,0,0,0,False,0,False,False,0,0,0
2023,01,CAD,56,1-10-300050010090000000,1,3073620,R,MARTINEZ JESSICA MARIE,,721 E BROWNING,,PAMPA,TX,79065,,10,01,02,03,10,12,22,32,,,,,,False,815,LOCUST,E,,TX,,,1 030,,False,False,C1,,,,,0,,1.000000,0,0.00,,,0,,,,,,,,0.1666,W9 OF 8 & ALL OF 9,BLK 1 ALLAM,,,,,,,,,0,1040,0,0,0,0,0,0,0,0,0,0,0,0,0,0,1040,1040,0,0,0,0,0,0,0,False,0,False,False,0,0,0
2023,01,CAD,57,1-10-300050020010000000,1,3051368,R,BATMAN MELVIN,,927 S HOBART,,PAMPA,TX,79065,,10,01,02,03,10,12,22,32,,,,,,False,862,LOCUST,E,,TX,,,,,False,False,A2,,,28X48 MOBILE HOME TXFLV8633015,MHP5,3200,,1.000000,0,0.00,,,0,,,,,,,,0.1570,LOT 1 BLK 2,ALLAM ADDITION,TXFLV8633015,,,,,,,,910,0,0,0,0,0,0,0,0,0,9010,0,0,0,0,0,9920,9920,0,0,0,0,0,0,0,False,0,False,False,0,0,0
2023,01,CAD,58,1-10-300050020020000000,1,578900,R,MARISCAL GRACIELA,,856 LOCUST,,PAMPA,TX,79065,,10,01,02,03,10,12,22,32,,,,,,False,856,LOCUST,E,,TX,,,1 030,,False,False,A1,,,,,0,,1.000000,0,0.00,,,0,,,,,,,,0.2961,LOT 2&3 BLK 2,ALLAM ADDITION,,,,,,,,,0,1720,0,0,0,0,0,0,0,0,14680,0,0,0,0,0,16400,16400,0,0,0,0,0,0,0,False,0,False,False,0,0,0
2023,01,CAD,60,1-10-300050020040000000,1,3072289,R,KELLY RUSSELL,,PO RET 04/21,,,,,,10,01,02,03,10,12,22,32,,,,,,False,852,LOCUST,E,,TX,,,1 030,,False,False,A1,,,,,0,,1.000000,0,0.00,,,0,,,,,,,,0.1481,LOT 4 BLK 2,ALLAM ADDITION,,,,,,,,,860,0,0,0,0,0,0,0,0,0,10940,0,0,0,0,0,11800,11800,0,0,0,0,0,0,0,False,0,False,False,0,0,0
2023,01,CAD,61,1-10-300050020050000000,1,3072919,R,TANGUMA JUAN & IRENE,,1112 STARKWEATHER,,PAMPA,TX,79065,,10,01,02,03,10,12,22,32,,,,,,False,842,LOCUST,E,,TX,,,1 030,,False,False,A1,,,,,0,,1.000000,0,0.00,,,0,,,,,,,,0.2961,LOTS 5&6 BLK 2,ALLAM,,,,,,,,,1720,0,0,0,0,0,0,0,0,0,10470,0,0,0,0,0,12190,12190,0,0,0,0,0,0,0,False,0,False,False,0,0,0
2023,01,CAD,62,1-10-300050020070000000,1,3071785,R,MCCLELLAND VICKIE,,828 E LOCUST,,PAMPA,TX,79065,,10,01,02,03,10,12,22,32,,,,,,False,828,LOCUST,E,,TX,,,1 030,,False,False,A2,,,32X68 FREEDOM,MHP5,3100,,1.000000,0,0.00,H,,0,,,,,,,,0.4442,LOTS 7-9 BLK 2,ALLAM ADDITION,,,,,,,,,2580,0,0,0,0,0,0,0,0,0,57230,0,0,0,0,0,59810,44590,0,0,0,0,0,0,0,False,0,False,False,0,0,0
2023,01,CAD,64,1-10-300050020100000000,1,100831,R,PATEL NIMIT I,,821 E FREDERIC,,PAMPA,TX,79065,,10,01,02,03,10,12,22,32,,,,,,False,829,FREDERIC,E,,TX,,,,,False,False,C1,,,,,0,,1.000000,0,0.00,,,0,,,,,,,,0.1180,N 120 OF LOT 10,BLK 2 ALLAM,829-831 E FREDERIC,,,,,,,,3870,0,0,0,0,0,0,0,0,0,0,0,0,0,0,0,3870,3870,0,0,0,0,0,0,0,False,0,False,False,0,0,0
2023,01,CAD,65,1-10-300050020110000000,1,100831,R,PATEL NIMIT I,,821 E FREDERIC,,PAMPA,TX,79065,,10,01,02,03,10,12,22,32,,,,,,False,833,FREDERIC,E,,TX,,,,,False,False,C1,,,NO MOBILE HOME,,0,,1.000000,0,0.00,,,0,,,,,,,,0.2370,N 120 OF LOT 11&12,BLK 2 ALLAM,,,,,,,,,7740,0,0,0,0,0,0,0,0,0,0,0,0,0,0,0,7740,7740,0,0,0,0,0,0,0,False,0,False,False,0,0,0
2023,01,CAD,66,1-10-300050020130000000,1,1012550,R,WHITSON JOHN C ESTATE,,304 ANNE,,PAMPA,TX,79065,,10,01,02,03,10,12,22,32,,,,,,False,845,FREDERIC,E,,TX,,,1 030,,False,False,A1,,,,,0,,1.000000,0,0.00,,,0,,,,,,,,0.2370,N 120 OF LOTS,13 & 14,ALLAM ADDITION,,,,,,,,7740,0,0,0,0,0,0,0,0,0,14250,0,0,0,0,0,21990,21990,0,0,0,0,0,0,0,False,0,False,False,0,0,0
2023,01,CAD,67,1-10-300050020150000000,1,331750,R,GARCIA JESUS & MARIA,,1041 HUFF RD,,PAMPA,TX,79065,,10,01,02,03,10,12,22,32,,,,,,False,859,FREDERIC,E,,,,,1-030,,False,False,F1,,,,,0,,1.000000,0,0.00,,,0,,,,,,,,0.4800,N120 OF 15-18,BLK 2 ALLAM,,,,,,,,,10450,0,0,0,0,0,0,0,0,0,0,0,32230,0,0,0,42680,42680,0,0,0,0,0,0,0,False,0,False,False,0,0,0
2023,01,CAD,68,1-10-300100010010000000,1,200900,R,COX JOHN L & BARBARA,,1501 N RUSSELL,,PAMPA,TX,79065,,10,01,02,03,10,12,22,32,,,,,,False,1501,RUSSELL,N,,TX,,,,,False,False,A1,,,,,0,,1.000000,0,0.00,H,,0,,,,,,,,0.4555,E144.8 OF 1&2 BLK 1,G H ALEXANDER S/D,,,,,,,,,7750,0,0,0,0,0,0,0,0,0,121260,0,0,0,0,0,129010,100330,0,0,0,0,0,0,0,False,0,False,False,0,0,0
2023,01,CAD,69,1-10-300100016030000000,1,485400,R,JOHNSON SCOTT,,1506 WILLISTON,,PAMPA,TX,79065,,10,01,02,03,10,12,22,32,,,,,,False,1506,WILLISTON,,,TX,,,4 020,,False,False,A1,,,,,0,,1.000000,0,0.00,H,,0,,,,,,,,0.1447,N 60 OF LOTS 3 & 4 BLK 1,G H ALEXANDER,SUBDIVISION,,,,,,,,4200,0,0,0,0,0,0,0,0,0,87920,0,0,0,0,0,92120,76560,0,0,0,0,0,0,0,False,0,False,False,0,0,0
2023,01,CAD,70,1-10-300100018030000000,1,543550,R,LEIGH JEFFREY G,,1500 WILLISTON,,PAMPA,TX,79065,,10,01,02,03,10,12,22,32,,,,,,False,1500,WILLISTON,,,TX,,,4 020,,False,False,A1,,,,,0,,1.000000,0,0.00,H,,0,,,,,,,,0.1825,S 75.7 OF 3 & 4 BLK 1,G H ALEXANDER,SUBDIVISION,,,,,,,,5300,0,0,0,0,0,0,0,0,0,143120,0,0,0,0,0,148420,140620,0,0,0,0,0,0,0,False,0,False,False,0,0,0
2023,01,CAD,71,1-10-300130030922070000,1,3074900,R,CARRASCO DELMA,,268646 IRON SQUIRE DR,,KINGWOOD,TX,77339,,10,01,02,03,10,12,22,32,,,,,,False,,,,,TX,,,,,False,False,C1R,,,,,0,,1.000000,0,0.00,,,0,,,,,,,,1.4700,SEC 92 BLK 3 I&GN,TRACT Q 1.47 ACS,,,,,,,,,0,4120,0,0,0,0,0,0,0,0,0,0,0,0,0,0,4120,4120,0,0,0,0,0,0,0,False,0,False,False,0,0,0
2023,01,CAD,73,1-10-300130030924060000,1,3072500,R,WADE WILLIAM E,,1776 E HARVESTER,,PAMPA,TX,79065,,10,01,02,03,10,12,22,32,,,,,,False,1776,HARVESTER,E,,TX,,,,,False,False,A1,,,,,0,,1.000000,0,0.00,H,,0,,,,,,,,0.8100,SEC 92 BLK 3 I&GN,.81 AC ABST 405,,,,,,,,,5670,0,0,0,0,0,0,0,0,0,256680,0,0,0,0,0,262350,251130,0,0,0,0,0,0,0,False,0,False,False,0,0,0
2023,01,CAD,74,1-10-300130030924070000,1,769350,R,REEVES DARIAN & CHRISTINA,,1700 E HARVESTER,,PAMPA,TX,79065,,10,01,02,03,10,12,22,32,,,,,,False,1700,HARVESTER,,,TX,,,,,False,False,A1,,,,,0,,1.000000,0,0.00,H,,0,,,,,,,,1.1700,SEC 92 BLK 3 I&GN,TRACT N 1.17 ACRES,NE/4,,,,,,,,8190,0,0,0,0,0,0,0,0,0,293420,0,0,0,0,0,301610,289550,0,0,0,0,0,0,0,False,0,False,False,0,0,0
2023,01,CAD,75,1-10-300130030924100000,1,372000,R,GRIMSLEY JUDITH ANN ESTATE,,RET P O 2012,,,,,,10,01,02,03,10,12,22,32,,,,,,False,1601,BROWNING,E,,,,,,,False,False,C1,,,,,0,,1.000000,0,0.00,,,0,,,,,,,,1.0000,SEC 92 BLK 3 I&GN,TRACT 0 1 ACRE,,,,,,,,,0,2800,0,0,0,0,0,0,0,0,0,0,0,0,0,0,2800,2800,0,0,0,0,0,0,0,False,0,False,False,0,0,0
2023,01,CAD,76,1-10-300130030924150000,1,513050,R,KIRBY TERESA ELAINE,,1701 E BROWNING,,PAMPA,TX,79065,,10,01,02,03,10,12,22,32,,,,,,False,1701,BROWNING,E,,,,,,,False,False,A1,,,,,0,,1.000000,0,0.00,H,,0,,,,,,,,1.5800,SEC 92 BLK 3 I&GN,TRACT P 1.58 ACRES,,,,,,,,,11060,0,0,0,0,0,0,0,0,0,84650,0,0,0,0,0,95710,86320,0,0,0,0,0,0,0,False,0,False,False,0,0,0
2023,01,CAD,77,1-10-300130030924250000,1,345200,R,GILES STEVEN,,1119 E HARVESTER,,PAMPA,TX,79065,4501,10,01,02,03,10,12,22,32,,,,,,False,,,,,TX,,,,,False,False,C1,,,,,0,,1.000000,0,0.00,,,0,,,,,,,,3.4090,SEC 92 BLK 3 I&GN,3.409 ACS SE/4 OF,TRACT S,,,,,,,,0,9550,0,0,0,0,0,0,0,0,0,0,300,0,0,0,9850,9850,0,0,0,0,0,0,0,False,0,False,False,0,0,0
2023,01,CAD,78,1-10-300130030924251000,1,3071228,R,ARNEY CLINTON,,1812 E HARVESTER,,PAMPA,TX,79065,,10,01,02,03,10,12,22,32,,,,,,False,1812,HARVESTER,E,,,,,,,False,False,A1,,,,,0,,1.000000,0,0.00,H,,0,,,,,,,,2.5510,SEC 92 BLK 3 I&GN,2.551 ACS N/W CORNER OF,TRACT S,,,,,,,,17860,0,0,0,0,0,0,0,0,0,243160,0,0,0,0,0,261020,246380,0,0,0,0,0,0,0,False,0,False,False,0,0,0
2023,01,CAD,79,1-10-300130031001000000,1,940800,R,THURMAN FAMILY LIVING TR,,PO BOX 924,,PAMPA,TX,79066,,10,01,02,03,10,12,22,32,,,,,,False,530,BROWN,W,,TX,,,,,False,False,F1,,,,,0,,1.000000,0,0.00,,,0,,,,,,,,0.9800,SEC 103 BLK 3 I&GN,.988 ACRES,,,,,,,,,4570,0,0,0,0,0,0,0,0,0,0,0,28510,0,0,0,33080,33080,0,0,0,0,0,0,0,False,0,False,False,0,0,0
2023,01,CAD,80,1-10-300130031030000000,1,568490,R,M&S LAND & CATTLE CO LLC,,2142 ASPEN DR,,PAMPA,TX,79065,,10,01,02,03,10,12,22,32,,,,,,False,,,,,TX,,,,,False,False,C1C,,,,,0,,1.000000,0,0.00,,,0,,,,,,,,4.2000,SEC 103 BLK 3 I&GN,4.204 AC,,,,,,,,,0,19570,0,0,0,0,0,0,0,0,0,0,0,0,0,0,19570,19570,0,0,0,0,0,0,0,False,0,False,False,0,0,0
2023,01,CAD,81,1-10-300130031031000000,1,164250,R,CHISUM FAMILY PARTNER LTD,,PO BOX 1512,,PAMPA,TX,79066,,10,01,02,03,10,12,22,32,,,,,,False,,,,,TX,,,,,False,False,C1R,,,,,0,,1.000000,0,0.00,,,0,,,,,,,,7.5400,SEC 103 BLK 3 I&GN,7.54 ACS,,,,,,,,,0,17570,0,0,0,0,0,0,0,0,0,0,0,0,0,0,17570,17570,0,0,0,0,0,0,0,False,0,False,False,0,0,0
2023,01,CAD,83,1-10-300130031032000000,1,3069240,R,INGRAM CONCRETE LLC,,331 NORTH MAIN ST,,EULESS,TX,76039,,10,01,02,03,10,12,22,32,,,,,,False,220,TYNG,W,,,,,,,False,False,F2,,,,,0,,1.000000,0,0.00,,,0,,,,,,,,2.5300,SEC 103 BLK 3 I&GN,2.53 AC,,,,,,,,,11790,0,0,0,0,0,0,0,0,0,0,0,80210,0,0,0,92000,92000,0,0,0,0,0,0,0,False,0,False,False,0,0,0
2023,01,CAD,84,1-10-300130031034000000,1,930400,R,TEXAS PIPE & METAL CO INC,,P O BOX 1816,,PAMPA,TX,79066,,10,01,02,03,10,12,22,32,,,,,,False,630,BROWN,W,,TX,,,,,False,False,F2,,,,,0,,1.000000,0,0.00,,,0,,,,,,,,6.7900,SEC 103 BLK 3  I&GN,6.790    ACS,,,,,,,,,0,31640,0,0,0,0,0,0,0,0,0,0,273330,0,0,0,304970,304970,0,0,0,0,0,0,0,False,0,False,False,0,0,0
2023,01,CAD,85,1-10-300130031161050000,1,3072686,R,"2101 W 23 PAMPA, LLC",A TEXAS LIMITED LIABILITY COMPANY,PO BOX 117144,,CARROLLTON,TX,75011,,10,01,02,03,10,12,22,32,,,,,,False,2101,23RD,W,,,,,,,False,False,F1,,,,,0,,1.000000,0,0.00,,R4413,1,P. E. PENNINGTON AND CO INC,PO BOX 116908,,CARROLLTON,TX,75011,,7.5000,SEC 116 BLK 3 I&GN,TRACT Z-A ZB & ZE,,,,,,,,,0,75000,0,0,0,0,0,0,0,0,0,0,775620,0,0,0,850620,850620,0,0,0,0,0,0,0,False,0,False,False,0,0,0
2023,01,CAD,88,1-10-300130031161150000,1,847850,R,SHULTS WENDELL R & CHARLA,,2137 N BANKS,,PAMPA,TX,79065,,10,01,02,03,10,12,22,32,,,,,,False,2013,23RD,W,,TX,,,4 060,,False,False,C1,,,,,0,,1.000000,0,0.00,,,0,,,,,,,,2.5000,SEC 116 BLK 3 I&GN,TRACT Z-C,,,,,,,,,17500,0,0,0,0,0,0,0,0,0,0,0,0,0,0,0,17500,17500,0,0,0,0,0,0,0,False,0,False,False,0,0,0
2023,01,CAD,90,1-10-300130031161300000,1,570200,R,MACKAYS ABOVE ALL STORAGE,,308 MESA CIRCLE,,PLAINVIEW,TX,79072,6508,10,01,02,03,10,12,22,32,,,,,,False,,23RD,W,PAMPA,TX,79065,,,,False,False,C1C,,,,,0,,1.000000,0,0.00,,,0,,,,,,,,5.0000,SEC 116 BLK 3 I&GN,TRACT Z-F,,,,,,,,,0,32500,0,0,0,0,0,0,0,0,0,0,0,0,0,0,32500,32500,0,0,0,0,0,0,0,False,0,False,False,0,0,0
2023,01,CAD,91,1-10-300130031161400000,1,3067916,R,JOHNSON JOE DALE,,P.O. BOX 2154,,PAMPA,TX,79066,,10,01,02,03,10,12,22,32,,,,,,False,,,,,TX,,,,,False,False,D1,D2,D2,,,0,,1.000000,0,0.00,,,0,,,,,,,,91.7800,SEC 116 BLK 3 I&GN TR Z-1 THRU,Z-4-1 & PARTS OF BLKS 3-6,SUNSET UNIT #1,,,,,,,,0,0,108580,19080,0,0,0,0,0,0,0,0,2880,0,0,0,111460,21960,0,0,0,0,0,0,0,False,0,False,False,0,0,0
2023,01,CAD,94,1-10-300130031161550000,1,3067916,R,JOHNSON JOE DALE,,P.O. BOX 2154,,PAMPA,TX,79066,,10,01,02,03,10,12,22,32,,,,,,False,1834,PRICE,,,TX,,,4 060,,False,False,A1,,,,,0,,1.000000,0,0.00,H,,0,,,,,,,,1.0000,SEC 116 BLK 3 I&GN,TRACT Z-4-C,,,,,,,,,7000,0,0,0,0,0,0,0,0,0,83620,0,0,0,0,0,90620,90620,0,0,0,0,0,0,0,False,0,False,False,0,0,0
2023,01,CAD,95,1-10-300130031161600000,1,578200,R,MARAK LYNN & SHERYL,,1810 N PRICE RD,,PAMPA,TX,79065,,10,01,02,03,10,12,22,32,,,,,,False,1810,PRICE,,,TX,,,4 060,,False,False,A1,,,,,0,,1.000000,0,0.00,H,,0,,,,,,,,0.6700,SEC 116 BLK 3 I&GN,TRACT Z-4-A,,,,,,,,,1680,0,0,0,0,0,0,0,0,0,49900,0,0,0,0,0,51580,51580,0,0,0,0,0,0,0,False,0,False,False,0,0,0
2023,01,CAD,96,1-10-300130031161650000,1,3069222,R,HENLEY JOHANNA COKER,,1800 DAVIS,,PAMPA,TX,79065,,10,01,02,03,10,12,22,32,,,,,,False,1800,DAVIS,,,TX,,,4 060,,False,False,A1,,,,,0,,1.000000,0,0.00,H,,0,,,,,,,,0.6100,SEC 116 BLK 3 I&GN,TRACT Z-4-B,,,,,,,,,4270,0,0,0,0,0,0,0,0,0,103230,0,0,0,0,0,107500,74790,0,0,0,0,0,0,0,False,0,False,False,0,0,0
2023,01,CAD,97,1-10-300130031161700000,1,146450,R,CARTER BILLY DUANE,,1800 N PRICE RD,,PAMPA,TX,79065,,10,01,02,03,10,12,22,32,,,,,,False,1800,PRICE,N,,TX,,,4 060,,False,False,A1,,,,,0,,1.000000,0,0.00,H,,0,,,,,,,,0.6400,SEC 116 BLK 3 I&GN,TRACT Z-4,.647 ACRES,,,,,,,,4480,0,0,0,0,0,0,0,0,0,68940,0,0,0,0,0,73420,73420,0,0,0,0,0,0,0,False,0,False,False,0,0,0
2023,01,CAD,99,1-10-300130031163050000,1,484800,R,JOHNSON RANDY DEAN,,285 COUNTY ROAD 304C,,SEMINOLE,TX,79360,,10,01,02,03,10,12,22,32,,,,,,False,,KENTUCKY,W,,TX,,,,,False,False,C1,,,,,0,,1.000000,0,0.00,,,0,,,,,,,,0.8400,SEC 116 BLK 3 I&GN,TRACT Y-1,,,,,,,,,0,1530,0,0,0,0,0,0,0,0,0,0,0,0,0,0,1530,1530,0,0,0,0,0,0,0,False,0,False,False,0,0,0
2023,01,CAD,100,1-10-300130031163100000,1,102104,R,KIMANN PROPERTIES LLC,,2301 CHATEAU RUE,,PAMPA,TX,79065,,10,01,02,03,10,12,22,32,,,,,,False,,KENTUCKY,W,,TX,,,,,False,False,C1C,,,,,0,,1.000000,0,0.00,,,0,,,,,,,,2.1000,SEC 116 BLK 3 I&GN,N306.18 OF TR Y1A &,Y1C  2.1 ACRES,,,,,,,,0,8400,0,0,0,0,0,0,0,0,0,0,0,0,0,0,8400,8400,0,0,0,0,0,0,0,False,0,False,False,0,0,0
2023,01,CAD,101,1-10-300130031163105500,1,270650,R,EASTSIDE PACKAGE LLC,DBA WESTSIDE PACKAGE,PO  BOX  1191,,CANADIAN,TX,79014,,10,01,02,03,10,12,22,32,,,,,,False,1300,PRICE,N,,TX,,,,,False,False,F1,,,,,0,,1.000000,0,0.00,,,0,,,,,,,,2.1000,SEC 116 BLK 3 I&GN,S306.82 OF TR Y1A &,Y1C  2.1 ACRES,,,,,,,,0,8400,0,0,0,0,0,0,0,0,0,0,551190,0,0,0,559590,559590,0,0,0,0,0,0,0,False,0,False,False,0,0,0
2023,01,CAD,102,1-10-300130031163150000,1,3068769,R,ISBELL LAURA SUE,,2212 W KENTUCKY,,PAMPA,TX,79065,,10,01,02,03,10,12,22,32,,,,,,False,2212,KENTUCKY,W,,TX,,,4 060,,False,False,A1,,,,,0,,1.000000,0,0.00,H,,0,,,,,,,,0.2400,SEC 116 BLK 3 I&GN,TRACT Y-1-B,,,,,,,,,1680,0,0,0,0,0,0,0,0,0,18190,0,0,0,0,0,19870,19870,0,0,0,0,0,0,0,False,0,False,False,0,0,0